{"text_format":"1","workbook":"xlsx","n_sheets":2,"sheets":["入替シート","meibo"],"not_rendered":{"charts":0,"images":0,"macros":1,"external_links":0,"defined_names":0,"comments":0,"pivot_tables":0},"unopened":[],"bounds":{"document_bytes":16777216,"sheet_cells":100000,"rows_first":2000,"rows_last":500,"rows_between":2000,"halvings":0,"cell_chars":16384,"cell_head_chars":4096},"cells_cut":0,"cells_raw":0,"read":"whole","date_system":"1900"}

{"sheet":"入替シート","index":0,"n_rows":28,"n_cols":20,"rows_kept":28,"cut":false,"hidden":false,"merged":[[18,5,19,5],[18,6,19,6],[18,7,19,7],[20,5,21,5],[20,6,21,6],[20,7,21,7],[16,10,17,10],[16,5,17,5],[16,6,17,6],[16,7,17,7],[16,8,17,8],[16,9,17,9],[14,6,15,6],[14,7,15,7],[14,8,15,8],[14,9,15,9],[26,6,27,6],[26,7,27,7],[22,6,23,6],[22,7,23,7],[14,10,15,10],[8,9,9,9],[8,10,9,10],[12,5,13,5],[12,6,13,6],[12,7,13,7],[12,8,13,8],[12,9,13,9],[12,10,13,10],[10,5,11,5],[10,6,11,6],[10,7,11,7],[10,8,11,8],[10,9,11,9],[10,10,11,10],[14,5,15,5],[6,10,7,10],[8,5,9,5],[1,0,2,3],[0,0,0,3],[3,5,3,6],[0,5,1,8],[8,6,9,6],[8,7,9,7],[8,8,9,8],[3,8,3,9],[6,5,7,5],[6,6,7,6],[6,7,7,7],[6,8,7,8],[6,9,7,9],[3,14,3,15],[3,16,3,17],[4,5,5,5],[4,6,5,6],[4,7,5,7],[4,8,5,8],[4,9,5,9],[4,10,5,10],[24,5,25,5],[24,6,25,6],[24,7,25,7],[26,5,27,5],[22,5,23,5]]}
["チーム名"]
["リコーブラックラムズ東京"]
[]
["No","氏名","F","カテゴリ",null,"OFF",null,"事項","ON",null,null,null,"事項","時間","OFF",null,"ON",null,"復帰時間／取消時間"]
[1,"谷口祐一郎","F",null,null,null,{"$f":"IF(F5=\"\",\"\",VLOOKUP(F5,meibo!$A$1:$D$23,2,0))","v":""},null,null,{"$f":"IF(I5=\"\",\"\",VLOOKUP(I5,meibo!$A$1:$D$23,2,0))","v":""},null,null,null,null,null,null,null,null,null,"No1"]
[2,"武井日向","F",null,null,null,null,null,null,null,null,null,null,null,null,null,null,null,null,"No2"]
[3,"大山祥平","F",null,null,null,{"$f":"IF(F7=\"\",\"\",VLOOKUP(F7,meibo!$A$1:$D$23,2,0))","v":""},null,null,{"$f":"IF(I7=\"\",\"\",VLOOKUP(I7,meibo!$A$1:$D$23,2,0))","v":""},null,null,null,null,null,null,null,null,null,"No3"]
[4,"柳川大樹",null,null,null,null,null,null,null,null,null,null,null,null,null,null,null,null,null,"No4"]
[5,"マイケル・ストーバーグ",null,"B",null,null,{"$f":"IF(F9=\"\",\"\",VLOOKUP(F9,meibo!$A$1:$D$23,2,0))","v":""},null,null,{"$f":"IF(I9=\"\",\"\",VLOOKUP(I9,meibo!$A$1:$D$23,2,0))","v":""},null,null,null,null,null,null,null,null,null,"No5"]
[6,"アマト・ファカタヴァ",null,null,null,null,null,null,null,null,null,null,null,null,null,null,null,null,null,"No6"]
[7,"松橋周平",null,null,null,null,{"$f":"IF(F11=\"\",\"\",VLOOKUP(F11,meibo!$A$1:$D$23,2,0))","v":""},null,null,{"$f":"IF(I11=\"\",\"\",VLOOKUP(I11,meibo!$A$1:$D$23,2,0))","v":""},null,null,null,null,null,null,null,null,null,"No7"]
[8,"ネイサン・ヒューズ",null,"C",null,null,null,null,null,null,null,null,null,null,null,null,null,null,null,"No8"]
[9,"山本昌太",null,null,null,null,{"$f":"IF(F13=\"\",\"\",VLOOKUP(F13,meibo!$A$1:$D$23,2,0))","v":""},null,null,{"$f":"IF(I13=\"\",\"\",VLOOKUP(I13,meibo!$A$1:$D$23,2,0))","v":""},null,null,null,null,null,null,null,null,null,"No9"]
[10,"マット・マッガーン",null,null,null,null,null,null,null,null,null,null,null,null,null,null,null,null,null,"No10"]
[11,"ネタニ・ヴァカヤリア",null,null,null,null,{"$f":"IF(F15=\"\",\"\",VLOOKUP(F15,meibo!$A$1:$D$23,2,0))","v":""},null,null,{"$f":"IF(I15=\"\",\"\",VLOOKUP(I15,meibo!$A$1:$D$23,2,0))","v":""},null,null,null,null,null,null,null,null,null,"No11"]
[12,"ハドレー・パークス",null,"C",null,null,null,null,null,null,null,null,null,null,null,null,null,null,null,"No12"]
[13,"栗原由太",null,null,null,null,{"$f":"IF(F17=\"\",\"\",VLOOKUP(F17,meibo!$A$1:$D$23,2,0))","v":""},null,null,{"$f":"IF(I17=\"\",\"\",VLOOKUP(I17,meibo!$A$1:$D$23,2,0))","v":""},null,null,null,null,null,null,null,null,null,"No13"]
[14,"シオペ・タヴォ",null,null,null,null,null,null,null,null,null,null,null,null,null,null,null,null,null,"No14"]
[15,"アイザック・ルーカス",null,"B",null,null,{"$f":"IF(F19=\"\",\"\",VLOOKUP(F19,meibo!$A$1:$D$23,2,0))","v":""},null,"OUT",null,null,null,null,null,null,null,null,null,null,"No15"]
[16,"佐藤康","F",null,null,null,null,null,"IN",null,null,null,null,null,null,null,null,null,null,"No16"]
[17,"西和磨","F",null,null,null,{"$f":"IF(F21=\"\",\"\",VLOOKUP(F21,meibo!$A$1:$D$23,2,0))","v":""},null,"OUT",null,null,null,null,null,null,null,null,null,null,"No17"]
[18,"千葉太一","F",null,null,null,null,null,"IN",null,null,null,null,null,null,null,null,null,null,"No18"]
[19,"ジェイコブ・スキーン",null,"B",null,null,{"$f":"IF(F23=\"\",\"\",VLOOKUP(F23,meibo!$A$1:$D$23,2,0))","v":""},null,"OUT",null,null,null,null,null,null,null,null,null,null,"No19"]
[20,"木原音弥",null,null,null,null,null,null,"IN",null,null,null,null,null,null,null,null,null,null,"No20"]
[21,"南昂伸",null,null,null,null,{"$f":"IF(F25=\"\",\"\",VLOOKUP(F25,meibo!$A$1:$D$23,2,0))","v":""},null,"OUT",null,null,null,null,null,null,null,null,null,null,"No21"]
[22,"堀米航平",null,null,null,null,null,null,"IN",null,null,null,null,null,null,null,null,null,null,"No22"]
[23,"セミシ・トゥポウ",null,"B",null,null,{"$f":"IF(F27=\"\",\"\",VLOOKUP(F27,meibo!$A$1:$D$23,2,0))","v":""},null,"OUT",null,null,null,null,null,null,null,null,null,null,"No23"]
[null,null,null,null,null,null,null,null,"IN",null,null,null,null,null,null,null,null,null,null,"No24"]

{"sheet":"meibo","index":1,"n_rows":23,"n_cols":4,"rows_kept":23,"cut":false,"hidden":false,"merged":[]}
[1,"谷口祐一郎","F"]
[2,"武井日向","F"]
[3,"大山祥平","F"]
[4,"柳川大樹"]
[5,"マイケル・ストーバーグ",null,"B"]
[6,"アマト・ファカタヴァ"]
[7,"松橋周平"]
[8,"ネイサン・ヒューズ",null,"C"]
[9,"山本昌太"]
[10,"マット・マッガーン"]
[11,"ネタニ・ヴァカヤリア"]
[12,"ハドレー・パークス",null,"C"]
[13,"栗原由太"]
[14,"シオペ・タヴォ"]
[15,"アイザック・ルーカス",null,"B"]
[16,"佐藤康","F"]
[17,"西和磨","F"]
[18,"千葉太一","F"]
[19,"ジェイコブ・スキーン",null,"B"]
[20,"木原音弥"]
[21,"南昂伸"]
[22,"堀米航平"]
[23,"セミシ・トゥポウ",null,"B"]